Target
Solute carrier family 22 member 1
Ligand
BDBM50420177
Substrate
Meas. Tech.
ChEMBL_838713 (CHEMBL2078495)
Ki
669200±n/a nM
Citation
 Urakami, YOkuda, MMasuda, SSaito, HInui, KI Functional characteristics and membrane localization of rat multispecific organic cation transporters, OCT1 and OCT2, mediating tubular secretion of cationic drugs. J Pharmacol Exp Ther 287:800-5 (1998) Target
Name:
Solute carrier family 22 member 1
Synonyms:
Adrenaline alpha1 Organic cation transporter 1 Slc22a1 adrenergic Alpha1 | rOCT1
Type:
Enzyme Catalytic Domain
Mol. Mass.:
61538.40
Organism:
RAT
Description:
Adrenaline alpha1 0 RAT::Q63089
Residue:
556
  
Inhibitor
Name:
BDBM50420177
Synonyms:
NICOTINYL METHYLAMIDE
Type:
Small organic molecule
Emp. Form.:
C7H8N2O
Mol. Mass.:
136.1512
SMILES:
CNC(=O)c1cccnc1
: