Target
Solute carrier family 22 member 2
Ligand
BDBM39344
Substrate
Meas. Tech.
ChEMBL_838507 (CHEMBL2078135)
Ki
36000±n/a nM
Citation
 Urakami, YOkuda, MMasuda, SAkazawa, MSaito, HInui, K Distinct characteristics of organic cation transporters, OCT1 and OCT2, in the basolateral membrane of renal tubules. Pharm Res 18:1528-34 (2001)  
Target
Name:
Solute carrier family 22 member 2
Synonyms:
Adrenaline alpha2 Organic cation transporter 2 Slc22a2 rOCT2
Type:
Enzyme Catalytic Domain
Mol. Mass.:
62348.38
Organism:
RAT
Description:
Adrenaline alpha2 0 RAT::Q9R0W2
Residue:
555
  
Inhibitor
Name:
BDBM39344
Synonyms:
4-amino-N-[2-(diethylamino)ethyl]benzamide;hydrochloride MLS000069436 PROCAINAMIDE HYDROCHLORIDE cid_66068
Type:
Small organic molecule
Emp. Form.:
C13H21N3O
Mol. Mass.:
235.3253
SMILES:
CCN(CC)CCNC(=O)c1ccc(N)cc1
: