Target
Solute carrier family 22 member 6
Ligand
BDBM25903
Substrate
Meas. Tech.
ChEMBL_838527 (CHEMBL2078155)
Ki
5500±n/a nM
Citation
 Uwai, YSaito, HHashimoto, YInui, KI Interaction and transport of thiazide diuretics, loop diuretics, and acetazolamide via rat renal organic anion transporter rOAT1. J Pharmacol Exp Ther 295:261-5 (2000) Target
Name:
Solute carrier family 22 member 6
Synonyms:
Oat1 S22A6_RAT rOAT1 renal organic anion transporter 1
Type:
PROTEIN
Mol. Mass.:
60784.17
Organism:
Rattus norvegicus
Description:
ChEMBL_838479
Residue:
551
  
Inhibitor
Name:
BDBM25903
Synonyms:
3-(butylamino)-4-phenoxy-5-sulfamoylbenzoic acid Bumex Fordiuran | cid_2471
Type:
Small organic molecule
Emp. Form.:
C17H20N2O5S
Mol. Mass.:
364.416
SMILES:
CCCCNc1cc(cc(c1Oc1ccccc1)S(N)(=O)=O)C(O)=O
: