Target
ATP-binding cassette sub-family C member 2
Ligand
BDBM50390978
Substrate
Meas. Tech.
ChEMBL_836120 (CHEMBL2077556)
Ki
28900±n/a nM
Citation
 Chen, ZSKawabe, TOno, MAoki, SSumizawa, TFurukawa, TUchiumi, TWada, MKuwano, MAkiyama, SI Effect of multidrug resistance-reversing agents on transporting activity of human canalicular multispecific organic anion transporter. Mol Pharmacol 56:1219-28 (1999)  
Target
Name:
ATP-binding cassette sub-family C member 2
Synonyms:
ABCC2 CMOAT CMRP Canalicular multispecific organic anion transporter 1 MRP2 Multidrug resistance-associated protein 2 Multidrug resistance-associated protein 3 (MRP3)
Type:
Protein
Mol. Mass.:
174229.45
Organism:
Homo sapiens (Human)
Description:
Q92887
Residue:
1545
  
Inhibitor
Name:
BDBM50390978
Synonyms:
VALSPODAR
Type:
Small organic molecule
Emp. Form.:
C63H111N11O12
Mol. Mass.:
1214.6219
SMILES:
C\C=C\C[C@@H](C)C(=O)[C@@H]1N(C)C(=O)[C@H](C(C)C)N(C)C(=O)[C@H](CC(C)C)N(C)C(=O)[C@H](CC(C)C)N(C)C(=O)[C@@H](C)NC(=O)[C@H](C)NC(=O)[C@H](CC(C)C)N(C)C(=O)[C@@H](NC(=O)[C@H](CC(C)C)N(C)C(=O)CN(C)C(=O)[C@@H](NC1=O)C(C)C)C(C)C
: