Target
Solute carrier family 22 member 8
Ligand
BDBM50420185
Substrate
Meas. Tech.
ChEMBL_838168 (CHEMBL2076640)
Ki
169000±n/a nM
Citation
 Enomoto, ATakeda, MTaki, KTakayama, FNoshiro, RNiwa, TEndou, H Interactions of human organic anion as well as cation transporters with indoxyl sulfate. Eur J Pharmacol 466:13-20 (2003)  
Target
Name:
Solute carrier family 22 member 8
Synonyms:
OAT3 S22A8_HUMAN hOAT3
Type:
PROTEIN
Mol. Mass.:
59870.13
Organism:
Homo sapiens (Human)
Description:
ChEMBL_1486920
Residue:
542
  
Inhibitor
Name:
BDBM50420185
Synonyms:
CHEMBL1233636
Type:
Small organic molecule
Emp. Form.:
C8H7NO4S
Mol. Mass.:
213.21
SMILES:
OS(=O)(=O)Oc1c[nH]c2ccccc12
: