Target
Ileal sodium/bile acid cotransporter
Ligand
BDBM50375599
Substrate
Meas. Tech.
ChEMBL_838471 (CHEMBL2076042)
Ki
6300±n/a nM
Citation
 Craddock, ALLove, MWDaniel, RWKirby, LCWalters, HCWong, MHDawson, PA Expression and transport properties of the human ileal and renal sodium-dependent bile acid transporter. Am J Physiol 274:157-69 (1998)  
Target
Name:
Ileal sodium/bile acid cotransporter
Synonyms:
ASBT IBAT Ileal Na(+)/bile acid cotransporter Ileal bile acid transporter/bile acid cotransporter NTCP2 SLC10A2
Type:
Enzyme
Mol. Mass.:
37714.89
Organism:
Homo sapiens (Human)
Description:
SLC10A2
Residue:
348
  
Inhibitor
Name:
BDBM50375599
Synonyms:
DEOXYCHOLATE KYBELLA
Type:
Small organic molecule
Emp. Form.:
C24H40O4
Mol. Mass.:
392.572
SMILES:
C[C@H](CCC(O)=O)[C@H]1CC[C@H]2[C@@H]3CC[C@@H]4C[C@H](O)CC[C@]4(C)[C@H]3C[C@H](O)[C@]12C
: