Target
ATP-dependent translocase ABCB1
Ligand
BDBM50338982
Substrate
Meas. Tech.
ChEMBL_838266 (CHEMBL2076214)
IC50
4700±n/a nM
Citation
 Wang, EJCasciano, CNClement, RPJohnson, WW Active transport of fluorescent P-glycoprotein substrates: evaluation as markers and interaction with inhibitors. Biochem Biophys Res Commun 289:580-5 (2001)  
Target
Name:
ATP-dependent translocase ABCB1
Synonyms:
ABCB1 MDR1_HUMAN Multidrug resistance protein 1 P-glycoprotein (P-gp) PGY1
Type:
Protein
Mol. Mass.:
141503.50
Organism:
Homo sapiens (Human)
Description:
P08183
Residue:
1280
  
Inhibitor
Name:
BDBM50338982
Synonyms:
(R)-5-((3,4-dimethoxyphenethyl)(methyl)amino)-2-(3,4-dimethoxyphenyl)-2-isopropylpentanenitrile (S)-2-(3,4-Dimethoxy-phenyl)-5-{[2-(3,4-dimethoxy-phenyl)-ethyl]-methyl-amino}-2-isopropyl-pentanenitrile; hydrochloride (Verapamil) 2-(3,4-Dimethoxy-phenyl)-5-{[2-(3,4-dimethoxy-phenyl)-ethyl]-methyl-amino}-2-isopropyl-pentanenitrile 2-(3,4-dimethoxy-phenyl)-5-{[2-(3,4-dimethoxy-phenyl)-ethyl]-methyl-amino}-2-isopropyl-pentanenitrile 5-((3,4-dimethoxyphenethyl)(methyl)amino)-2-(3,4-dimethoxyphenyl)-2-isopropylpentanenitrile 5-{[2-(3,4-Dimethoxy-phenyl)-ethyl]-methyl-amino}-2-isopropyl-2-(4-methoxy-phenyl)-pentanenitrile Calan Covera-HS Iproveratril Isoptin SR VERAPAMIL Verapramil verapamil-R
Type:
Small organic molecule
Emp. Form.:
C27H38N2O4
Mol. Mass.:
454.6016
SMILES:
COc1ccc(CCN(C)CCC[C@@](C#N)(C(C)C)c2ccc(OC)c(OC)c2)cc1OC
: