Target
ATP-dependent translocase ABCB1
Ligand
BDBM50012278
Substrate
Meas. Tech.
ChEMBL_838270 (CHEMBL2076218)
IC50
17700±n/a nM
Citation
 Wang, EJCasciano, CNClement, RPJohnson, WW Active transport of fluorescent P-glycoprotein substrates: evaluation as markers and interaction with inhibitors. Biochem Biophys Res Commun 289:580-5 (2001)  
Target
Name:
ATP-dependent translocase ABCB1
Synonyms:
ABCB1 MDR1_HUMAN Multidrug resistance protein 1 P-glycoprotein (P-gp) PGY1
Type:
Protein
Mol. Mass.:
141503.50
Organism:
Homo sapiens (Human)
Description:
P08183
Residue:
1280
  
Inhibitor
Name:
BDBM50012278
Synonyms:
(2ALPHA,2''BETA,3BETA,4ALPHA,5BETA)-VINCALEUKOBLASTINE VINBLASTINE cid_5388983
Type:
Small organic molecule
Emp. Form.:
C46H58N4O9
Mol. Mass.:
810.9741
SMILES:
CC[C@]1(O)C[C@@H]2CN(C1)CCc1c([nH]c3ccccc13)[C@@](C2)(C(=O)OC)c1cc2c(cc1OC)N(C)[C@@H]1[C@]22CCN3CC=C[C@](CC)([C@@H]23)[C@@H](OC(C)=O)[C@]1(O)C(=O)OC
: