Target
ATP-dependent translocase ABCB1
Ligand
BDBM50367247
Substrate
Meas. Tech.
ChEMBL_838718 (CHEMBL2078544)
IC50
184900±n/a nM
Citation
 Wang, EJCasciano, CNClement, RPJohnson, WW Active transport of fluorescent P-glycoprotein substrates: evaluation as markers and interaction with inhibitors. Biochem Biophys Res Commun 289:580-5 (2001)  
Target
Name:
ATP-dependent translocase ABCB1
Synonyms:
ABCB1 MDR1_HUMAN Multidrug resistance protein 1 P-glycoprotein (P-gp) PGY1
Type:
Protein
Mol. Mass.:
141503.50
Organism:
Homo sapiens (Human)
Description:
P08183
Residue:
1280
  
Inhibitor
Name:
BDBM50367247
Synonyms:
QUININE Quinsan | cid_3034034
Type:
Small organic molecule
Emp. Form.:
C20H24N2O2
Mol. Mass.:
324.4168
SMILES:
COc1ccc2nccc([C@@H](O)[C@@H]3C[C@@H]4CCN3C[C@@H]4C=C)c2c1
: