Target
Bile salt export pump
Ligand
BDBM50420224
Substrate
Meas. Tech.
ChEMBL_838278 (CHEMBL2076226)
IC50
189200±n/a nM
Citation
 Wang, EJCasciano, CNClement, RPJohnson, WW Fluorescent substrates of sister-P-glycoprotein (BSEP) evaluated as markers of active transport and inhibition: evidence for contingent unequal binding sites. Pharm Res 20:537-44 (2003)  
Target
Name:
Bile salt export pump
Synonyms:
ABCB11 ATP-binding cassette sub-family B member 11 Bile Salt Export Pump, BSEP Bile salt export pump (BSEP)
Type:
Protein
Mol. Mass.:
146405.49
Organism:
Homo sapiens (Human)
Description:
O95342
Residue:
1321
  
Inhibitor
Name:
BDBM50420224
Synonyms:
CHEMBL2074694
Type:
Small organic molecule
Emp. Form.:
C26H44NO5S
Mol. Mass.:
482.697
SMILES:
C[C@H](CCC(=O)NCCS([O-])(=O)=O)[C@H]1CC[C@H]2[C@@H]3CC[C@@H]4C[C@H](O)CC[C@]4(C)[C@H]3CC[C@]12C
: