Target
Bile salt export pump
Ligand
BDBM50001839
Substrate
Meas. Tech.
ChEMBL_838278 (CHEMBL2076226)
IC50
28900±n/a nM
Citation
 Wang, EJCasciano, CNClement, RPJohnson, WW Fluorescent substrates of sister-P-glycoprotein (BSEP) evaluated as markers of active transport and inhibition: evidence for contingent unequal binding sites. Pharm Res 20:537-44 (2003)  
Target
Name:
Bile salt export pump
Synonyms:
ABCB11 ATP-binding cassette sub-family B member 11 Bile Salt Export Pump, BSEP Bile salt export pump (BSEP)
Type:
Protein
Mol. Mass.:
146405.49
Organism:
Homo sapiens (Human)
Description:
O95342
Residue:
1321
  
Inhibitor
Name:
BDBM50001839
Synonyms:
CHEMBL428647 taxol
Type:
Small organic molecule
Emp. Form.:
C47H51NO14
Mol. Mass.:
853.9061
SMILES:
CC(=O)O[C@@H]1C2=C(C)[C@H](C[C@@](O)([C@@H](OC(=O)c3ccccc3)[C@@H]3[C@@]4(CO[C@@H]4C[C@H](O)[C@@]3(C)C1=O)OC(C)=O)C2(C)C)OC(=O)[C@H](O)[C@@H](NC(=O)c1ccccc1)c1ccccc1
: