Target
Solute carrier family 22 member 6
Ligand
BDBM50420189
Substrate
Meas. Tech.
ChEMBL_836970 (CHEMBL2075810)
Ki
22400±n/a nM
Citation
 Islinger, FGekle, MWright, SH Interaction of 2,3-dimercapto-1-propane sulfonate with the human organic anion transporter hOAT1. J Pharmacol Exp Ther 299:741-7 (2001) Target
Name:
Solute carrier family 22 member 6
Synonyms:
OAT1 PAH transporter Renal organic anion transporter 1 SLC22A6 hPAHT | hROAT1
Type:
PROTEIN
Mol. Mass.:
61831.78
Organism:
Homo sapiens (Human)
Description:
ChEMBL_1487359
Residue:
563
  
Inhibitor
Name:
BDBM50420189
Synonyms:
CHEMBL1624767
Type:
Small organic molecule
Emp. Form.:
C3H8O3S3
Mol. Mass.:
188.289
SMILES:
OS(=O)(=O)CC(S)CS
: