Target
ATP-binding cassette sub-family C member 5
Ligand
BDBM50001285
Substrate
Meas. Tech.
ChEMBL_836094 (CHEMBL2077530)
IC50
40000±n/a nM
Citation
 Reid, GWielinga, PZelcer, NDe Haas, MVan Deemter, LWijnholds, JBalzarini, JBorst, P Characterization of the transport of nucleoside analog drugs by the human multidrug resistance proteins MRP4 and MRP5. Mol Pharmacol 63:1094-103 (2003)  
Target
Name:
ATP-binding cassette sub-family C member 5
Synonyms:
ABCC5 MOAT-C MRP5_HUMAN Multidrug resistance-associated protein 5 pABC11
Type:
PROTEIN
Mol. Mass.:
160694.29
Organism:
Homo sapiens (Human)
Description:
ChEMBL_836094
Residue:
1437
  
Inhibitor
Name:
BDBM50001285
Synonyms:
(E)-3-((3-(2-(7-chloroquinolin-2-yl)vinyl)phenyl)(3-(dimethylamino)-3-oxopropylthio)methylthio)propanoic acid 3-((3-(2-(7-chloroquinolin-2-yl)vinyl)phenyl)(3-(dimethylamino)-3-oxopropylthio)methylthio)propanoic acid 3-[{3-[(E)-2-(7-Chloro-quinolin-2-yl)-vinyl]-phenyl}-(2-dimethylcarbamoyl-ethylsulfanyl)-methylsulfanyl]-propionic acid 3-[{3-[2-(7-Chloro-quinolin-2-yl)-vinyl]-phenyl}-(2-dimethylcarbamoyl-ethylsulfanyl)-methylsulfanyl]-propionic acid(MK-571, L-660711) L-660711 MK-571
Type:
Small organic molecule
Emp. Form.:
C26H27ClN2O3S2
Mol. Mass.:
515.087
SMILES:
CN(C)C(=O)CCSC(SCCC(O)=O)c1cccc(\C=C\c2ccc3ccc(Cl)cc3n2)c1
: