Target
Solute carrier family 22 member 2
Ligand
BDBM50170653
Substrate
Meas. Tech.
ChEMBL_838700 (CHEMBL2078482)
IC50
34200±n/a nM
Citation
 Hayer-Zillgen, MBrüss, MBönisch, H Expression and pharmacological profile of the human organic cation transporters hOCT1, hOCT2 and hOCT3. Br J Pharmacol 136:829-36 (2002)  
Target
Name:
Solute carrier family 22 member 2
Synonyms:
OCT2 S22A2_HUMAN hOCT2
Type:
PROTEIN
Mol. Mass.:
62591.01
Organism:
Homo sapiens (Human)
Description:
ChEMBL_1484077
Residue:
555
  
Inhibitor
Name:
BDBM50170653
Synonyms:
(11beta)-11,21-dihydroxypregn-4-ene-3,20-dione 11beta,21-dihydroxyprogesterone CHEMBL110739 | corticosterone
Type:
Small organic molecule
Emp. Form.:
C21H30O4
Mol. Mass.:
346.4605
SMILES:
C[C@]12C[C@H](O)[C@H]3[C@@H](CCC4=CC(=O)CC[C@]34C)[C@@H]1CC[C@@H]2C(=O)CO
: