Target
ATP-binding cassette sub-family C member 2
Ligand
BDBM50420238
Substrate
Meas. Tech.
ChEMBL_836948 (CHEMBL2075788)
Ki
92800±n/a nM
Citation
 Masuda, MI'izuka, YYamazaki, MNishigaki, RKato, YNi'inuma, KSuzuki, HSugiyama, Y Methotrexate is excreted into the bile by canalicular multispecific organic anion transporter in rats. Cancer Res 57:3506-10 (1997) Target
Name:
ATP-binding cassette sub-family C member 2
Synonyms:
ATP-binding cassette sub-family C member 2 Canalicular multidrug resistance protein Cmoat MRP2_RAT Multidrug resistance-associated protein 2
Type:
PROTEIN
Mol. Mass.:
173415.22
Organism:
Rattus norvegicus
Description:
ChEMBL_1455464
Residue:
1541
  
Inhibitor
Name:
BDBM50420238
Synonyms:
CHEMBL156
Type:
Small organic molecule
Emp. Form.:
C20H22N8O5
Mol. Mass.:
454.4393
SMILES:
CN(Cc1cnc2nc(N)nc(N)c2n1)c1ccc(cc1)C(=O)N[C@H](CCC(O)=O)C(O)=O
: