Target
Solute carrier family 22 member 6
Ligand
BDBM50350467
Substrate
Meas. Tech.
ChEMBL_838516 (CHEMBL2078144)
Ki
6140±n/a nM
Citation
 Takeda, MBabu, ENarikawa, SEndou, H Interaction of human organic anion transporters with various cephalosporin antibiotics. Eur J Pharmacol 438:137-42 (2002)  
Target
Name:
Solute carrier family 22 member 6
Synonyms:
OAT1 PAH transporter Renal organic anion transporter 1 SLC22A6 hPAHT | hROAT1
Type:
PROTEIN
Mol. Mass.:
61831.78
Organism:
Homo sapiens (Human)
Description:
ChEMBL_1487359
Residue:
563
  
Inhibitor
Name:
BDBM50350467
Synonyms:
BL-S578 Cefadrops
Type:
Small organic molecule
Emp. Form.:
C16H17N3O5S
Mol. Mass.:
363.388
SMILES:
CC1=C(N2[C@H](SC1)[C@H](NC(=O)[C@H](N)c1ccc(O)cc1)C2=O)C(O)=O
: