Target
ATP-dependent translocase ABCB1
Ligand
BDBM50390978
Substrate
Meas. Tech.
ChEMBL_837041 (CHEMBL2076126)
IC50
1060±n/a nM
Citation
 Kusunoki, NTakara, KTanigawara, YYamauchi, AUeda, KKomada, FKu, YKuroda, YSaitoh, YOkumura, K Inhibitory effects of a cyclosporin derivative, SDZ PSC 833, on transport of doxorubicin and vinblastine via human P-glycoprotein. Jpn J Cancer Res 89:1220-8 (1999)  
Target
Name:
ATP-dependent translocase ABCB1
Synonyms:
ABCB1 MDR1_HUMAN Multidrug resistance protein 1 P-glycoprotein (P-gp) PGY1
Type:
Protein
Mol. Mass.:
141503.50
Organism:
Homo sapiens (Human)
Description:
P08183
Residue:
1280
  
Inhibitor
Name:
BDBM50390978
Synonyms:
VALSPODAR
Type:
Small organic molecule
Emp. Form.:
C63H111N11O12
Mol. Mass.:
1214.6219
SMILES:
C\C=C\C[C@@H](C)C(=O)[C@@H]1N(C)C(=O)[C@H](C(C)C)N(C)C(=O)[C@H](CC(C)C)N(C)C(=O)[C@H](CC(C)C)N(C)C(=O)[C@@H](C)NC(=O)[C@H](C)NC(=O)[C@H](CC(C)C)N(C)C(=O)[C@@H](NC(=O)[C@H](CC(C)C)N(C)C(=O)CN(C)C(=O)[C@@H](NC1=O)C(C)C)C(C)C
: