Target
ATP-binding cassette sub-family C member 4
Ligand
BDBM50420253
Substrate
Meas. Tech.
ChEMBL_836095 (CHEMBL2077531)
IC50
50000±n/a nM
Citation
 Zelcer, NReid, GWielinga, PKuil, Avan der Heijden, ISchuetz, JDBorst, P Steroid and bile acid conjugates are substrates of human multidrug-resistance protein (MRP) 4 (ATP-binding cassette C4). Biochem J 371:361-7 (2003)  
Target
Name:
ATP-binding cassette sub-family C member 4
Synonyms:
ABCC4 MOAT-B MRP/cMOAT-related ABC transporter MRP4_HUMAN Multidrug resistance-associated protein 4
Type:
PROTEIN
Mol. Mass.:
149546.12
Organism:
Homo sapiens (Human)
Description:
ChEMBL_1486828
Residue:
1325
  
Inhibitor
Name:
BDBM50420253
Synonyms:
CHEMBL2074973
Type:
Small organic molecule
Emp. Form.:
C18H23O5S
Mol. Mass.:
351.438
SMILES:
C[C@]12CC[C@H]3[C@@H](CCc4cc(OS([O-])(=O)=O)ccc34)[C@@H]1CC[C@H]2O
: