Target
ATP-binding cassette sub-family C member 4
Ligand
BDBM50420224
Substrate
Meas. Tech.
ChEMBL_838528 (CHEMBL2078156)
IC50
20000±n/a nM
Citation
 Zelcer, NReid, GWielinga, PKuil, Avan der Heijden, ISchuetz, JDBorst, P Steroid and bile acid conjugates are substrates of human multidrug-resistance protein (MRP) 4 (ATP-binding cassette C4). Biochem J 371:361-7 (2003)  
Target
Name:
ATP-binding cassette sub-family C member 4
Synonyms:
ABCC4 MOAT-B MRP/cMOAT-related ABC transporter MRP4_HUMAN Multidrug resistance-associated protein 4
Type:
PROTEIN
Mol. Mass.:
149546.12
Organism:
Homo sapiens (Human)
Description:
ChEMBL_1486828
Residue:
1325
  
Inhibitor
Name:
BDBM50420224
Synonyms:
CHEMBL2074694
Type:
Small organic molecule
Emp. Form.:
C26H44NO5S
Mol. Mass.:
482.697
SMILES:
C[C@H](CCC(=O)NCCS([O-])(=O)=O)[C@H]1CC[C@H]2[C@@H]3CC[C@@H]4C[C@H](O)CC[C@]4(C)[C@H]3CC[C@]12C
: