Target
Casein kinase I isoform alpha
Ligand
BDBM50420297
Substrate
Meas. Tech.
ChEMBL_839751 (CHEMBL2089673)
IC50
180±n/a nM
Citation
 Bettayeb, KGresh, NMeijer, LOumata, N Synthesis and biological evaluation of selective and potent cyclin-dependent kinase inhibitors. Eur J Med Chem 56:210-216 (2012)  
Target
Name:
Casein kinase I isoform alpha
Synonyms:
CK1 CSNK1A1 Casein kinase 1 alpha (CK1 alpha) KC1A_HUMAN
Type:
Serine/threonine-protein kinase
Mol. Mass.:
38936.59
Organism:
Homo sapiens (Human)
Description:
P48729
Residue:
337
  
Inhibitor
Name:
BDBM50420297
Synonyms:
CHEMBL2089032
Type:
Small organic molecule
Emp. Form.:
C23H27N7O2
Mol. Mass.:
433.5062
SMILES:
CC(C)n1cnc2c(NCc3ccc(cc3)-c3ccccn3)nc(NC[C@@H](O)CO)nc12
: