Target
Casein kinase I isoform alpha
Ligand
BDBM50420299
Substrate
Meas. Tech.
ChEMBL_839751 (CHEMBL2089673)
IC50
390±n/a nM
Citation
 Bettayeb, KGresh, NMeijer, LOumata, N Synthesis and biological evaluation of selective and potent cyclin-dependent kinase inhibitors. Eur J Med Chem 56:210-216 (2012)  
Target
Name:
Casein kinase I isoform alpha
Synonyms:
CK1 CSNK1A1 Casein kinase 1 alpha (CK1 alpha) KC1A_HUMAN
Type:
Serine/threonine-protein kinase
Mol. Mass.:
38936.59
Organism:
Homo sapiens (Human)
Description:
P48729
Residue:
337
  
Inhibitor
Name:
BDBM50420299
Synonyms:
CHEMBL2089034
Type:
Small organic molecule
Emp. Form.:
C25H29N7O2
Mol. Mass.:
459.5435
SMILES:
CC(C)n1cnc2c(NCc3ccc(cc3)-c3ccccn3)nc(nc12)N1C[C@H](O)C[C@H]1CO
: