Target
Neuronal acetylcholine receptor subunit alpha-7
Ligand
BDBM50420607
Substrate
Meas. Tech.
ChEMBL_842055 (CHEMBL2091472)
EC50
1150±n/a nM
Citation
 Zanaletti, RBettinetti, LCastaldo, CCocconcelli, GComery, TDunlop, JGaviraghi, GGhiron, CHaydar, SNJow, FMaccari, LMicco, INencini, AScali, CTurlizzi, EValacchi, M Discovery of a novel alpha-7 nicotinic acetylcholine receptor agonist series and characterization of the potent, selective, and orally efficacious agonist 5-(4-acetyl[1,4]diazepan-1-yl)pentanoic acid [5-(4-methoxyphenyl)-1H-pyrazol-3-yl] amide (SEN15924, WAY-361789). J Med Chem 55:4806-23 (2012)  
Target
Name:
Neuronal acetylcholine receptor subunit alpha-7
Synonyms:
ACHA7_RAT Cholinergic, Nicotinic Alpha7 Chrna7 Neuronal acetylcholine receptor (alpha7 nAChR) Neuronal acetylcholine receptor subunit alpha-7 Neuronal acetylcholine receptor subunit alpha-7 (nAChR)
Type:
Enzyme
Mol. Mass.:
56502.44
Organism:
Rattus norvegicus (Rat)
Description:
Q05941
Residue:
502
  
Inhibitor
Name:
BDBM50420607
Synonyms:
CHEMBL2087448
Type:
Small organic molecule
Emp. Form.:
C19H25BrN4O
Mol. Mass.:
405.332
SMILES:
Brc1ccc(cc1)-c1cc(NC(=O)CCCCN2CCCCC2)[nH]n1
: