Target
Activated CDC42 kinase 1
Ligand
BDBM50421261
Substrate
Meas. Tech.
ChEMBL_840100 (CHEMBL2090704)
IC50
550±n/a nM
Citation
 Jiao, XKopecky, DJLiu, JLiu, JJaen, JCCardozo, MGSharma, RWalker, NWesche, HLi, SFarrelly, EXiao, SHWang, ZKayser, F Synthesis and optimization of substituted furo[2,3-d]-pyrimidin-4-amines and 7H-pyrrolo[2,3-d]pyrimidin-4-amines as ACK1 inhibitors. Bioorg Med Chem Lett 22:6212-7 (2012)  
Target
Name:
Activated CDC42 kinase 1
Synonyms:
ACK-1 Ack1 Tnk2
Type:
PROTEIN
Mol. Mass.:
116986.19
Organism:
Mus musculus
Description:
ChEMBL_840100
Residue:
1055
  
Inhibitor
Name:
BDBM50421261
Synonyms:
CHEMBL2087879
Type:
Small organic molecule
Emp. Form.:
C27H30N4O2S2
Mol. Mass.:
506.683
SMILES:
CN(C)CCOc1ccc(cc1)-c1oc2ncnc(NCC3SCCCS3)c2c1-c1ccccc1
: