Target
Activated CDC42 kinase 1
Ligand
BDBM50421272
Substrate
Meas. Tech.
ChEMBL_840100 (CHEMBL2090704)
IC50
550±n/a nM
Citation
 Jiao, XKopecky, DJLiu, JLiu, JJaen, JCCardozo, MGSharma, RWalker, NWesche, HLi, SFarrelly, EXiao, SHWang, ZKayser, F Synthesis and optimization of substituted furo[2,3-d]-pyrimidin-4-amines and 7H-pyrrolo[2,3-d]pyrimidin-4-amines as ACK1 inhibitors. Bioorg Med Chem Lett 22:6212-7 (2012)  
Target
Name:
Activated CDC42 kinase 1
Synonyms:
ACK-1 Ack1 Tnk2
Type:
PROTEIN
Mol. Mass.:
116986.19
Organism:
Mus musculus
Description:
ChEMBL_840100
Residue:
1055
  
Inhibitor
Name:
BDBM50421272
Synonyms:
CHEMBL2087648
Type:
Small organic molecule
Emp. Form.:
C24H23N3O3
Mol. Mass.:
401.4577
SMILES:
COc1ccc(cc1)-c1oc2ncnc(NC[C@@H]3CCCO3)c2c1-c1ccccc1
: