Target
Beta-1 adrenergic receptor
Ligand
BDBM50128690
Substrate
Meas. Tech.
ChEMBL_841416 (CHEMBL2091585)
Ki
3922±n/a nM
Citation
 Beattie, DBeer, DBradley, MEBruce, ICharlton, SJCuenoud, BMFairhurst, RAFarr, DFozard, JRJanus, DRosethorne, EMSandham, DASykes, DATrifilieff, ATurner, KLWissler, E An investigation into the structure-activity relationships associated with the systematic modification of theß(2)-adrenoceptor agonist indacaterol. Bioorg Med Chem Lett 22:6280-5 (2012)  
Target
Name:
Beta-1 adrenergic receptor
Synonyms:
ADRB1 ADRB1_HUMAN Beta-1 adrenoceptor | adrenergic Beta1
Type:
G Protein-Coupled Receptor (GPCR)
Mol. Mass.:
51338.40
Organism:
Homo sapiens (Human)
Description:
P08588
Residue:
477
  
Inhibitor
Name:
BDBM50128690
Synonyms:
4-Hydroxy-7-{2-[2-(3-phenethyloxy-propane-1-sulfonyl)-ethylamino]-ethyl}-3H-benzothiazol-2-one SB-07499
Type:
Small organic molecule
Emp. Form.:
C22H28N2O5S2
Mol. Mass.:
464.598
SMILES:
Oc1ccc(CCNCCS(=O)(=O)CCCOCCc2ccccc2)c2sc(=O)[nH]c12
: