Target
Beta-1 adrenergic receptor
Ligand
BDBM50421325
Substrate
Meas. Tech.
ChEMBL_841416 (CHEMBL2091585)
Ki
183±n/a nM
Citation
 Beattie, DBeer, DBradley, MEBruce, ICharlton, SJCuenoud, BMFairhurst, RAFarr, DFozard, JRJanus, DRosethorne, EMSandham, DASykes, DATrifilieff, ATurner, KLWissler, E An investigation into the structure-activity relationships associated with the systematic modification of theß(2)-adrenoceptor agonist indacaterol. Bioorg Med Chem Lett 22:6280-5 (2012)  
Target
Name:
Beta-1 adrenergic receptor
Synonyms:
ADRB1 ADRB1_HUMAN Beta-1 adrenoceptor | adrenergic Beta1
Type:
G Protein-Coupled Receptor (GPCR)
Mol. Mass.:
51338.40
Organism:
Homo sapiens (Human)
Description:
P08588
Residue:
477
  
Inhibitor
Name:
BDBM50421325
Synonyms:
CHEMBL2088197
Type:
Small organic molecule
Emp. Form.:
C24H30N2O3
Mol. Mass.:
394.5066
SMILES:
CCc1cc2CC(Cc2cc1CC)NC[C@H](O)c1ccc(O)c2NC(=O)CCc12
: