Target
D(2) dopamine receptor
Ligand
BDBM50128690
Substrate
Meas. Tech.
ChEMBL_841418 (CHEMBL2091587)
EC50
4.5±n/a nM
Citation
 Beattie, DBeer, DBradley, MEBruce, ICharlton, SJCuenoud, BMFairhurst, RAFarr, DFozard, JRJanus, DRosethorne, EMSandham, DASykes, DATrifilieff, ATurner, KLWissler, E An investigation into the structure-activity relationships associated with the systematic modification of theß(2)-adrenoceptor agonist indacaterol. Bioorg Med Chem Lett 22:6280-5 (2012)  
Target
Name:
D(2) dopamine receptor
Synonyms:
D(2) dopamine receptor DOPAMINE D2 Long DRD2 Dopamine D2 receptor Dopamine D2 receptor (D2R) Dopamine2-like | d2
Type:
Cell-surface receptors
Mol. Mass.:
50647.10
Organism:
Homo sapiens (Human)
Description:
P14416
Residue:
443
  
Inhibitor
Name:
BDBM50128690
Synonyms:
4-Hydroxy-7-{2-[2-(3-phenethyloxy-propane-1-sulfonyl)-ethylamino]-ethyl}-3H-benzothiazol-2-one SB-07499
Type:
Small organic molecule
Emp. Form.:
C22H28N2O5S2
Mol. Mass.:
464.598
SMILES:
Oc1ccc(CCNCCS(=O)(=O)CCCOCCc2ccccc2)c2sc(=O)[nH]c12
: