Target
Alpha-1B adrenergic receptor
Ligand
BDBM50421517
Substrate
Meas. Tech.
ChEBML_34483
IC50
10471±n/a nM
Citation
 Bishop, MJBerman, JBigham, ECGarrison, DTGobel, MJHodson, SJIrving, PELiacos, JAMinick, DJNavas, FSaussy, DLSpeake, JD 2-(Anilinomethyl)imidazolines as alpha(1)-adrenoceptor agonists: the identification of alpha(1A) subtype selective 2'-carboxylic acid esters and amides. Bioorg Med Chem Lett 11:2871-4 (2001)  
Target
Name:
Alpha-1B adrenergic receptor
Synonyms:
ADA1B_HUMAN Adrenergic alpha1B Adrenergic receptor alpha Alpha 1B-adrenoreceptor | Alpha-1B adrenergic receptor
Type:
Enzyme
Mol. Mass.:
56862.13
Organism:
Homo sapiens (Human)
Description:
P35368
Residue:
520
  
Inhibitor
Name:
BDBM50421517
Synonyms:
CHEMBL450018
Type:
Small organic molecule
Emp. Form.:
C14H20N4O
Mol. Mass.:
260.3348
SMILES:
CCN(C)C(=O)c1ccccc1NCC1=NCCN1
: