Target
Alpha-1A adrenergic receptor
Ligand
BDBM50218601
Substrate
Meas. Tech.
ChEMBL_32510 (CHEMBL641225)
EC50
6.3±n/a nM
Citation
 Hodson, SJBigham, ECGarrison, DTGobel, MJIrving, PELiacos, JANavas, FSaussy, DLSherman, BWSpeake, JDBishop, MJ Alpha(1)-adrenoceptor activation: a comparison of 4-(anilinomethyl)imidazoles and 4-(phenoxymethyl)imidazoles to related 2-imidazolines. Bioorg Med Chem Lett 12:3449-52 (2002)  
Target
Name:
Alpha-1A adrenergic receptor
Synonyms:
ADA1A_HUMAN ADRA1C Alpha 1A-adrenoceptor Alpha adrenergic receptor 1a Alpha-adrenergic receptor 1c adrenergic Alpha1 | adrenergic Alpha1C
Type:
Cell-surface receptors
Mol. Mass.:
51511.67
Organism:
Homo sapiens (Human)
Description:
P35348
Residue:
466
  
Inhibitor
Name:
BDBM50218601
Synonyms:
CHEMBL114669
Type:
Small organic molecule
Emp. Form.:
C14H15N3O
Mol. Mass.:
241.2884
SMILES:
Oc1ccc2cccc(NCC3=NCCN3)c2c1
: