Target
Alpha-1A adrenergic receptor
Ligand
BDBM50000213
Substrate
Meas. Tech.
ChEMBL_33755 (CHEMBL650229)
EC50
13±n/a nM
Citation
 Bishop, MJBarvian, KABerman, JBigham, ECGarrison, DTGobel, MJHodson, SJIrving, PELiacos, JANavas, FSaussy, DLSpeake, JD alpha(1)-Adrenoceptor agonists: the identification of novel alpha(1A )subtype selective 2'-heteroaryl-2-(phenoxymethyl)imidazolines. Bioorg Med Chem Lett 12:471-5 (2002)  
Target
Name:
Alpha-1A adrenergic receptor
Synonyms:
ADA1A_HUMAN ADRA1C Alpha 1A-adrenoceptor Alpha adrenergic receptor 1a Alpha-adrenergic receptor 1c adrenergic Alpha1 | adrenergic Alpha1C
Type:
Cell-surface receptors
Mol. Mass.:
51511.67
Organism:
Homo sapiens (Human)
Description:
P35348
Residue:
466
  
Inhibitor
Name:
BDBM50000213
Synonyms:
CHEMBL341747
Type:
Small organic molecule
Emp. Form.:
C14H15N3OS
Mol. Mass.:
273.353
SMILES:
Cc1cnsc1-c1ccccc1OCC1=NCCN1
: