Target
Alpha-1A adrenergic receptor
Ligand
BDBM50000215
Substrate
Meas. Tech.
ChEMBL_33755 (CHEMBL650229)
EC50
316±n/a nM
Citation
 Bishop, MJBarvian, KABerman, JBigham, ECGarrison, DTGobel, MJHodson, SJIrving, PELiacos, JANavas, FSaussy, DLSpeake, JD alpha(1)-Adrenoceptor agonists: the identification of novel alpha(1A )subtype selective 2'-heteroaryl-2-(phenoxymethyl)imidazolines. Bioorg Med Chem Lett 12:471-5 (2002)  
Target
Name:
Alpha-1A adrenergic receptor
Synonyms:
ADA1A_HUMAN ADRA1C Alpha 1A-adrenoceptor Alpha adrenergic receptor 1a Alpha-adrenergic receptor 1c adrenergic Alpha1 | adrenergic Alpha1C
Type:
Cell-surface receptors
Mol. Mass.:
51511.67
Organism:
Homo sapiens (Human)
Description:
P35348
Residue:
466
  
Inhibitor
Name:
BDBM50000215
Synonyms:
NS-49
Type:
Small organic molecule
Emp. Form.:
C9H13FN2O3S
Mol. Mass.:
248.275
SMILES:
CS(=O)(=O)Nc1ccc(F)c(c1)[C@@H](O)CN
: