Target
Alpha-1D adrenergic receptor
Ligand
BDBM50421593
Substrate
Meas. Tech.
ChEMBL_32583 (CHEMBL643421)
IC50
54±n/a nM
Citation
 Bishop, MJBarvian, KABerman, JBigham, ECGarrison, DTGobel, MJHodson, SJIrving, PELiacos, JANavas, FSaussy, DLSpeake, JD alpha(1)-Adrenoceptor agonists: the identification of novel alpha(1A )subtype selective 2'-heteroaryl-2-(phenoxymethyl)imidazolines. Bioorg Med Chem Lett 12:471-5 (2002)  
Target
Name:
Alpha-1D adrenergic receptor
Synonyms:
ADA1D_HUMAN ADRA1D Adrenergic receptor alpha Alpha 1D-adrenoreceptor Alpha-1D adrenoceptor adrenergic Alpha1D
Type:
Enzyme Catalytic Domain
Mol. Mass.:
60485.82
Organism:
Homo sapiens (Human)
Description:
adrenergic Alpha1D ADRA1D HUMAN::P25100
Residue:
572
  
Inhibitor
Name:
BDBM50421593
Synonyms:
CHEMBL357129
Type:
Small organic molecule
Emp. Form.:
C14H15N3O
Mol. Mass.:
241.2884
SMILES:
C(Oc1ccccc1-c1ccc[nH]1)C1=NCCN1
: