Target
Alpha-1B adrenergic receptor
Ligand
BDBM50219164
Substrate
Meas. Tech.
ChEMBL_34480 (CHEMBL875931)
EC50
<5012±n/a nM
Citation
 Navas, FBishop, MJGarrison, DTHodson, SJSpeake, JDBigham, ECDrewry, DHSaussy, DLLiacos, JHIrving, PEGobel, MJ 2-(anilinomethyl)imidazolines as alpha1A adrenergic receptor agonists: 2'-heteroaryl and 2'-oxime ether series. Bioorg Med Chem Lett 12:575-9 (2002)  
Target
Name:
Alpha-1B adrenergic receptor
Synonyms:
ADA1B_HUMAN Adrenergic alpha1B Adrenergic receptor alpha Alpha 1B-adrenoreceptor | Alpha-1B adrenergic receptor
Type:
Enzyme
Mol. Mass.:
56862.13
Organism:
Homo sapiens (Human)
Description:
P35368
Residue:
520
  
Inhibitor
Name:
BDBM50219164
Synonyms:
CHEMBL156893
Type:
Small organic molecule
Emp. Form.:
C14H16N6
Mol. Mass.:
268.317
SMILES:
Nc1nccc(n1)-c1ccccc1NCC1=NCCN1
: