Target
Alpha-1D adrenergic receptor
Ligand
BDBM50421596
Substrate
Meas. Tech.
ChEBML_32584
IC50
347±n/a nM
Citation
 Navas, FBishop, MJGarrison, DTHodson, SJSpeake, JDBigham, ECDrewry, DHSaussy, DLLiacos, JHIrving, PEGobel, MJ 2-(anilinomethyl)imidazolines as alpha1A adrenergic receptor agonists: 2'-heteroaryl and 2'-oxime ether series. Bioorg Med Chem Lett 12:575-9 (2002)  
Target
Name:
Alpha-1D adrenergic receptor
Synonyms:
ADA1D_HUMAN ADRA1D Adrenergic receptor alpha Alpha 1D-adrenoreceptor Alpha-1D adrenoceptor adrenergic Alpha1D
Type:
Enzyme Catalytic Domain
Mol. Mass.:
60485.82
Organism:
Homo sapiens (Human)
Description:
adrenergic Alpha1D ADRA1D HUMAN::P25100
Residue:
572
  
Inhibitor
Name:
BDBM50421596
Synonyms:
CHEMBL154023
Type:
Small organic molecule
Emp. Form.:
C14H16N4O
Mol. Mass.:
256.303
SMILES:
Cc1ncoc1-c1ccccc1NCC1=NCCN1
: