Target
Alpha-1A adrenergic receptor
Ligand
BDBM50421601
Substrate
Meas. Tech.
ChEBML_33871
IC50
81±n/a nM
Citation
 Navas, FBishop, MJGarrison, DTHodson, SJSpeake, JDBigham, ECDrewry, DHSaussy, DLLiacos, JHIrving, PEGobel, MJ 2-(anilinomethyl)imidazolines as alpha1A adrenergic receptor agonists: 2'-heteroaryl and 2'-oxime ether series. Bioorg Med Chem Lett 12:575-9 (2002)  
Target
Name:
Alpha-1A adrenergic receptor
Synonyms:
ADA1A_HUMAN ADRA1C Alpha 1A-adrenoceptor Alpha adrenergic receptor 1a Alpha-adrenergic receptor 1c adrenergic Alpha1 | adrenergic Alpha1C
Type:
Cell-surface receptors
Mol. Mass.:
51511.67
Organism:
Homo sapiens (Human)
Description:
P35348
Residue:
466
  
Inhibitor
Name:
BDBM50421601
Synonyms:
CHEMBL154298
Type:
Small organic molecule
Emp. Form.:
C15H16N4
Mol. Mass.:
252.3143
SMILES:
C(Nc1ccccc1-c1ccccn1)C1=NCCN1
: