Target
Integrin alpha-4/beta-1
Ligand
BDBM50134696
Substrate
Meas. Tech.
ChEMBL_213400 (CHEMBL815267)
IC50
10±n/a nM
Citation
 Stasiak, MMehlin, CBoni, EVaisar, TLittle, TKim, HOQabar, M Sulphonamide-based small molecule VLA-4 antagonists. Bioorg Med Chem Lett 13:3875-8 (2003)  
Target
Name:
Integrin alpha-4/beta-1
Synonyms:
Fibronectin receptor beta/Integrin alpha-4 | Integrin alpha-4/beta-1
Type:
Mol. Mass.:
Description:
ASSAY_ID of EBI is 88912
Components:
This complex has 2 components.
Component 1
Name:
Integrin beta-1
Synonyms:
CD_antigen=CD29 Fibronectin receptor beta GPIIA ITGB1 MDF2 | MSK12
Type:
Enzyme
Mol. Mass.:
88400.38
Organism:
Homo sapiens (Human)
Description:
P05556
Residue:
798
  
Component 2
Name:
Integrin alpha-4
Synonyms:
CD49 antigen-like family member D CD49d antigen ITA4_HUMAN Integrin alpha-4 Integrin alpha-IV VLA-4 integrin alpha 4 precursor | integrin alpha-4 precursor
Type:
Membrane Protein
Mol. Mass.:
114897.35
Organism:
Homo sapiens (Human)
Description:
P13612
Residue:
1032
  
Inhibitor
Name:
BDBM50134696
Synonyms:
(S)-2-{2-[Carboxymethyl-(pyridine-2-sulfonyl)-amino]-acetylamino}-3-[4-(2,6-dichloro-benzyloxy)-phenyl]-propionic acid | CHEMBL338758
Type:
Small organic molecule
Emp. Form.:
C25H23Cl2N3O8S
Mol. Mass.:
596.436
SMILES:
OC(=O)CN(CC(=O)N[C@@H](Cc1ccc(OCc2c(Cl)cccc2Cl)cc1)C(O)=O)S(=O)(=O)c1ccccn1
: