Target
Acetylcholinesterase
Ligand
BDBM50135149
Substrate
Meas. Tech.
ChEBML_29848
IC50
229087±n/a nM
Citation
 Zaheer-ul-Haq, naWellenzohn, BTonmunphean, SKhalid, AChoudhary, MIRode, BM 3D-QSAR studies on natural acetylcholinesterase inhibitors of Sarcococca saligna by comparative molecular field analysis (CoMFA). Bioorg Med Chem Lett 13:4375-80 (2003)  
Target
Name:
Acetylcholinesterase
Synonyms:
ACES_HUMAN Acetylcholinesterase (AChE) | Acetylcholinesterase (human AChE)
Type:
Enzyme
Mol. Mass.:
67792.70
Organism:
Homo sapiens (Human)
Description:
P22303
Residue:
614
  
Inhibitor
Name:
BDBM50135149
Synonyms:
Acetic acid (2S,3S,4R,5R,8S,9S,10R,13S,14S,17S)-3-benzoylamino-17-((S)-1-dimethylamino-ethyl)-2-hydroxy-10,13-dimethyl-hexadecahydro-cyclopenta[a]phenanthren-4-yl ester CHEMBL413039
Type:
Small organic molecule
Emp. Form.:
C32H48N2O4
Mol. Mass.:
524.7345
SMILES:
C[C@@H]([C@H]1CC[C@H]2[C@@H]3CC[C@H]4[C@@H](OC(C)=O)[C@@H](NC(=O)c5ccccc5)[C@@H](O)C[C@]4(C)[C@H]3CC[C@]12C)N(C)C
: