Target
Alpha-1B adrenergic receptor
Ligand
BDBM50222911
Substrate
Meas. Tech.
ChEMBL_34478 (CHEMBL651233)
EC50
200±n/a nM
Citation
 Speake, JDNavas, FBishop, MJGarrison, DTBigham, ECHodson, SJSaussy, DLLiacos, JAIrving, PESherman, BW 2-(Anilinomethyl)imidazolines as alpha1 adrenergic receptor agonists: alpha1a subtype selective 2'-heteroaryl compounds. Bioorg Med Chem Lett 13:1183-6 (2003)  
Target
Name:
Alpha-1B adrenergic receptor
Synonyms:
ADA1B_HUMAN Adrenergic alpha1B Adrenergic receptor alpha Alpha 1B-adrenoreceptor | Alpha-1B adrenergic receptor
Type:
Enzyme
Mol. Mass.:
56862.13
Organism:
Homo sapiens (Human)
Description:
P35368
Residue:
520
  
Inhibitor
Name:
BDBM50222911
Synonyms:
CHEMBL18436
Type:
Small organic molecule
Emp. Form.:
C16H22N6
Mol. Mass.:
298.3861
SMILES:
CCCCn1ncnc1-c1ccccc1NCC1=NCCN1
: