Target
Alpha-1B adrenergic receptor
Ligand
BDBM50421640
Substrate
Meas. Tech.
ChEBML_34484
IC50
398±n/a nM
Citation
 Speake, JDNavas, FBishop, MJGarrison, DTBigham, ECHodson, SJSaussy, DLLiacos, JAIrving, PESherman, BW 2-(Anilinomethyl)imidazolines as alpha1 adrenergic receptor agonists: alpha1a subtype selective 2'-heteroaryl compounds. Bioorg Med Chem Lett 13:1183-6 (2003)  
Target
Name:
Alpha-1B adrenergic receptor
Synonyms:
ADA1B_HUMAN Adrenergic alpha1B Adrenergic receptor alpha Alpha 1B-adrenoreceptor | Alpha-1B adrenergic receptor
Type:
Enzyme
Mol. Mass.:
56862.13
Organism:
Homo sapiens (Human)
Description:
P35368
Residue:
520
  
Inhibitor
Name:
BDBM50421640
Synonyms:
CHEMBL17851
Type:
Small organic molecule
Emp. Form.:
C14H17N5
Mol. Mass.:
255.3183
SMILES:
Cn1nccc1-c1ccccc1NCC1=NCCN1
: