Target
Beta-2 adrenergic receptor
Ligand
BDBM50169785
Substrate
Meas. Tech.
ChEMBL_37818 (CHEMBL651193)
Kd
27±n/a nM
Citation
 IJzerman, APAué, GHBultsma, TLinschoten, MRTimmerman, H Quantitative evaluation of the beta 2-adrenoceptor affinity of phenoxypropanolamines and phenylethanolamines. J Med Chem 28:1328-34 (1985)  
Target
Name:
Beta-2 adrenergic receptor
Synonyms:
ADRB2 Beta-2 adrenergic receptor Beta-2 adrenoreceptor | adrenergic Beta
Type:
Enzyme Catalytic Domain
Mol. Mass.:
47141.18
Organism:
BOVINE
Description:
adrenergic Beta ADRB2 BOVINE::Q28044
Residue:
418
  
Inhibitor
Name:
BDBM50169785
Synonyms:
(2-Hydroxy-3-phenoxy-propyl)-isopropyl-ammonium 1-Isopropylamino-3-phenoxy-propan-2-ol | CHEMBL7154
Type:
Small organic molecule
Emp. Form.:
C12H19NO2
Mol. Mass.:
209.2848
SMILES:
CC(C)NCC(O)COc1ccccc1
: