Target
Beta-2 adrenergic receptor
Ligand
BDBM50421717
Substrate
Meas. Tech.
ChEBML_37826
Kd
130±n/a nM
Citation
 IJzerman, APAué, GHBultsma, TLinschoten, MRTimmerman, H Quantitative evaluation of the beta 2-adrenoceptor affinity of phenoxypropanolamines and phenylethanolamines. J Med Chem 28:1328-34 (1985)  
Target
Name:
Beta-2 adrenergic receptor
Synonyms:
ADRB2 Beta-2 adrenergic receptor Beta-2 adrenoreceptor | adrenergic Beta
Type:
Enzyme Catalytic Domain
Mol. Mass.:
47141.18
Organism:
BOVINE
Description:
adrenergic Beta ADRB2 BOVINE::Q28044
Residue:
418
  
Inhibitor
Name:
BDBM50421717
Synonyms:
TULOBUTEROL | Tulobuterol Hydrochloride
Type:
Small organic molecule
Emp. Form.:
C12H18ClNO
Mol. Mass.:
227.73
SMILES:
CC(C)(C)NCC(O)c1ccccc1Cl
: