Target
Renin
Ligand
BDBM50024181
Substrate
Meas. Tech.
ChEBML_154901
IC50
141±n/a nM
Citation
 Nisato, DWagnon, JCallet, GMettefeu, DAssens, JLPlouzane, CTonnerre, BPliska, VFauchère, JL Renin inhibitors. Free-Wilson and correlation analysis of the inhibitory potency of a series of pepstatin analogues on plasma renin. J Med Chem 30:2287-91 (1988)  
Target
Name:
Renin
Synonyms:
Angiotensinogenase RENI_HUMAN
Type:
Enzyme
Mol. Mass.:
45058.99
Organism:
Homo sapiens (Human)
Description:
Residue:
406
  
Inhibitor
Name:
BDBM50024181
Synonyms:
4-(2-{4-[2-[2-tert-Butoxycarbonylamino-3-(1H-indol-3-yl)-propionylamino]-3-(1H-imidazol-4-yl)-propionylamino]-3-hydroxy-6-methyl-heptanoylamino}-propionylamino)-3-hydroxy-6-methyl-heptanoic acid methyl ester | CHEMBL3142783
Type:
Small organic molecule
Emp. Form.:
C42H64N8O10
Mol. Mass.:
841.0052
SMILES:
COC(=O)C[C@H](O)[C@H](CC(C)C)NC(=O)[C@H](C)NC(=O)C[C@H](O)[C@H](CC(C)C)NC(=O)[C@H](Cc1c[nH]cn1)NC(=O)[C@H](Cc1c[nH]c2ccccc12)NC(=O)OC(C)(C)C
: