Target
Renin
Ligand
BDBM50024169
Substrate
Meas. Tech.
ChEBML_154901
IC50
1413±n/a nM
Citation
 Nisato, DWagnon, JCallet, GMettefeu, DAssens, JLPlouzane, CTonnerre, BPliska, VFauchère, JL Renin inhibitors. Free-Wilson and correlation analysis of the inhibitory potency of a series of pepstatin analogues on plasma renin. J Med Chem 30:2287-91 (1988)  
Target
Name:
Renin
Synonyms:
Angiotensinogenase RENI_HUMAN
Type:
Enzyme
Mol. Mass.:
45058.99
Organism:
Homo sapiens (Human)
Description:
Residue:
406
  
Inhibitor
Name:
BDBM50024169
Synonyms:
4-(2-{4-[2-(2-Benzyloxycarbonylamino-3-phenyl-propionylamino)-3-(1H-indol-3-yl)-propionylamino]-3-hydroxy-6-methyl-heptanoylamino}-propionylamino)-3-hydroxy-6-methyl-heptanoic acid methyl ester | CHEMBL3142780
Type:
Small organic molecule
Emp. Form.:
C48H64N6O10
Mol. Mass.:
885.056
SMILES:
COC(=O)C[C@H](O)[C@H](CC(C)C)NC(=O)[C@H](C)NC(=O)C[C@H](O)[C@H](CC(C)C)NC(=O)[C@H](Cc1c[nH]c2ccccc12)NC(=O)[C@H](Cc1ccccc1)NC(=O)OCc1ccccc1
: