Target
D(2) dopamine receptor
Ligand
BDBM50421912
Substrate
Meas. Tech.
ChEBML_60934
IC50
589±n/a nM
Citation
 Russell, MGBaker, RBillington, DCKnight, AKMiddlemiss, DNNoble, AJ Benz[f]isoquinoline analogues as high-affinity sigma ligands. J Med Chem 35:2025-33 (1992)  
Target
Name:
D(2) dopamine receptor
Synonyms:
DOPAMINE D2 DOPAMINE D2 Short Dopamine D2 receptor Drd2
Type:
G Protein-Coupled Receptor (GPCR)
Mol. Mass.:
50931.60
Organism:
Rattus norvegicus (rat)
Description:
P61169
Residue:
444
  
Inhibitor
Name:
BDBM50421912
Synonyms:
CHEMBL545447
Type:
Small organic molecule
Emp. Form.:
C21H24N2O2
Mol. Mass.:
336.4275
SMILES:
[O-][N+](=O)c1ccc(CCN2CC[C@@H]3[C@@H](CCc4ccccc34)C2)cc1
: