Target
Sigma non-opioid intracellular receptor 1
Ligand
BDBM50421945
Substrate
Meas. Tech.
ChEBML_201732
IC50
2.0±n/a nM
Citation
 Chambers, MSBaker, RBillington, DCKnight, AKMiddlemiss, DNWong, EH Spiropiperidines as high-affinity, selective sigma ligands. J Med Chem 35:2033-9 (1992)  
Target
Name:
Sigma non-opioid intracellular receptor 1
Synonyms:
Aging-associated gene 8 protein SGMR1_HUMAN SIGMAR1 SR31747-binding protein Sigma 1-type opioid receptor Sigma1R | hSigmaR1
Type:
Enzyme Catalytic Domain
Mol. Mass.:
25124.85
Organism:
Homo sapiens (Human)
Description:
Q99720
Residue:
223
  
Inhibitor
Name:
BDBM50421945
Synonyms:
CHEMBL1744017
Type:
Small organic molecule
Emp. Form.:
C17H25N
Mol. Mass.:
243.3871
SMILES:
CCCCN1CCC2(CCc3ccccc23)CC1
: