Target
Sigma non-opioid intracellular receptor 1
Ligand
BDBM50421944
Substrate
Meas. Tech.
ChEBML_201732
IC50
6.8±n/a nM
Citation
 Chambers, MSBaker, RBillington, DCKnight, AKMiddlemiss, DNWong, EH Spiropiperidines as high-affinity, selective sigma ligands. J Med Chem 35:2033-9 (1992)  
Target
Name:
Sigma non-opioid intracellular receptor 1
Synonyms:
Aging-associated gene 8 protein SGMR1_HUMAN SIGMAR1 SR31747-binding protein Sigma 1-type opioid receptor Sigma1R | hSigmaR1
Type:
Enzyme Catalytic Domain
Mol. Mass.:
25124.85
Organism:
Homo sapiens (Human)
Description:
Q99720
Residue:
223
  
Inhibitor
Name:
BDBM50421944
Synonyms:
CHEMBL1744011
Type:
Small organic molecule
Emp. Form.:
C22H27N
Mol. Mass.:
305.4565
SMILES:
C(N1CCC2(CC1)CCCCc1ccccc21)c1ccccc1
: