Target
D(2) dopamine receptor
Ligand
BDBM50421934
Substrate
Meas. Tech.
ChEBML_60935
IC50
1950±n/a nM
Citation
 Chambers, MSBaker, RBillington, DCKnight, AKMiddlemiss, DNWong, EH Spiropiperidines as high-affinity, selective sigma ligands. J Med Chem 35:2033-9 (1992)  
Target
Name:
D(2) dopamine receptor
Synonyms:
DOPAMINE D2 DOPAMINE D2 Short Dopamine D2 receptor Drd2
Type:
G Protein-Coupled Receptor (GPCR)
Mol. Mass.:
50931.60
Organism:
Rattus norvegicus (rat)
Description:
P61169
Residue:
444
  
Inhibitor
Name:
BDBM50421934
Synonyms:
CHEMBL1744000
Type:
Small organic molecule
Emp. Form.:
C21H31N
Mol. Mass.:
297.4775
SMILES:
C(C1CCCCC1)N1CCC2(CCCc3ccccc23)CC1
: