Target
D(2) dopamine receptor
Ligand
BDBM50421946
Substrate
Meas. Tech.
ChEBML_60935
IC50
891±n/a nM
Citation
 Chambers, MSBaker, RBillington, DCKnight, AKMiddlemiss, DNWong, EH Spiropiperidines as high-affinity, selective sigma ligands. J Med Chem 35:2033-9 (1992)  
Target
Name:
D(2) dopamine receptor
Synonyms:
DOPAMINE D2 DOPAMINE D2 Short Dopamine D2 receptor Drd2
Type:
G Protein-Coupled Receptor (GPCR)
Mol. Mass.:
50931.60
Organism:
Rattus norvegicus (rat)
Description:
P61169
Residue:
444
  
Inhibitor
Name:
BDBM50421946
Synonyms:
CHEMBL1788383
Type:
Small organic molecule
Emp. Form.:
C20H23N
Mol. Mass.:
277.4033
SMILES:
C(N1CCC2(CCc3ccccc23)CC1)c1ccccc1
: