Target
Gastrin/cholecystokinin type B receptor
Ligand
BDBM50449787
Substrate
Meas. Tech.
ChEMBL_48241 (CHEMBL660310)
IC50
0.138000±n/a nM
Citation
 Dezube, MSugg, EEBirkemo, LSCroom, DKDougherty, RWErvin, GNGrizzle, MKJames, MKJohnson, MFMosher, JT Modification of receptor selectivity and functional activity in cholecystokinin peptoid ligands. J Med Chem 38:3384-90 (1995)  
Target
Name:
Gastrin/cholecystokinin type B receptor
Synonyms:
CCK-2 receptor CCK-BR CCKRB Cholecystokinin receptor GASR_HUMAN | Gastrin/cholecystokinin type B receptor
Type:
G Protein-Coupled Receptor (GPCR)
Mol. Mass.:
48445.79
Organism:
Homo sapiens (Human)
Description:
Stable expression of human CCK-2 receptors in HEK 293 cells.
Residue:
447
  
Inhibitor
Name:
BDBM50449787
Synonyms:
CHEMBL2062154 | PD-134308
Type:
Small organic molecule
Emp. Form.:
C35H42N4O6
Mol. Mass.:
614.7312
SMILES:
[H][C@@]12C[C@@]3([H])C[C@@]([H])(C1)C(OC(=O)N[C@](C)(Cc1c[nH]c4ccccc14)C(=O)NC[C@H](NC(=O)CCC(O)=O)c1ccccc1)[C@@]([H])(C2)C3
: