Target
Gag-Pol polyprotein [489-587]
Ligand
BDBM50455439
Substrate
Meas. Tech.
ChEMBL_158029 (CHEMBL877854)
IC50
145±n/a nM
Citation
 Pérez, CPastor, MOrtiz, ARGago, F Comparative binding energy analysis of HIV-1 protease inhibitors: incorporation of solvent effects and validation as a powerful tool in receptor-based drug design. J Med Chem 41:836-52 (1998)  
Target
Name:
Gag-Pol polyprotein [489-587]
Synonyms:
Human immunodeficiency virus type 1 protease Pol polyprotein | gag-pol
Type:
Enzyme Subunit
Mol. Mass.:
10781.16
Organism:
Human immunodeficiency virus type 1
Description:
P04585[489-587]
Residue:
99
  
Inhibitor
Name:
BDBM50455439
Synonyms:
CHEMBL2367852
Type:
Small organic molecule
Emp. Form.:
C32H40N2O4
Mol. Mass.:
516.671
SMILES:
[H][C@](C)(NC(=O)[C@]([H])(Cc1ccccc1)C[C@]([H])(O)[C@]([H])(Cc1ccccc1)NC(=O)OC(C)(C)C)c1ccccc1
: